Target
Gamma-aminobutyric acid receptor subunit alpha-2
Ligand
BDBM25878
Substrate
Ki
5.2±n/a nM
Comments
PDSP_828
Citation
 Hadingham, KLWingrove, PLe Bourdelles, BPalmer, KJRagan, CIWhiting, PJ Cloning of cDNA sequences encoding human alpha 2 and alpha 3 gamma-aminobutyric acidA receptor subunits and characterization of the benzodiazepine pharmacology of recombinant alpha 1-, alpha 2-, alpha 3-, and alpha 5-containing human gamma-aminobutyric acidA receptors. Mol Pharmacol 43:970-5 (1993) Target
Name:
Gamma-aminobutyric acid receptor subunit alpha-2
Synonyms:
GABA receptor alpha-2 subunit GBRA2_HUMAN | Gamma-aminobutyric acid receptor subunit alpha-2 (GABRA2)
Type:
Protein
Mol. Mass.:
51338.78
Organism:
Homo sapiens (Human)
Description:
P47869
Residue:
451
  
Inhibitor
Name:
BDBM25878
Synonyms:
5-(2-fluorophenyl)-1-methyl-7-nitro-2,3-dihydro-1H-1,4-benzodiazepin-2-one Flunitrazepam [3H]flunitrazepam
Type:
radiolabeled ligand
Emp. Form.:
C16H12FN3O3
Mol. Mass.:
313.2832
SMILES:
CN1c2ccc(cc2C(=NCC1=O)c1ccccc1F)[N+]([O-])=O
: