Target
5-hydroxytryptamine receptor 7
Ligand
BDBM82087
Substrate
Ki
0.57±n/a nM
Comments
PDSP_172
Citation
 Shen, YMonsma, FJMetcalf, MAJose, PAHamblin, MWSibley, DR Molecular cloning and expression of a 5-hydroxytryptamine7 serotonin receptor subtype. J Biol Chem 268:18200-4 (1993) Target
Name:
5-hydroxytryptamine receptor 7
Synonyms:
5-HT-7 5-HT7 5-HT7S 5-hydroxytryptamine receptor 7 5HT7R_RAT GPRFO Serotonin (5-HT) receptor | Serotonin Receptor 7
Type:
G Protein-Coupled Receptor (GPCR)
Mol. Mass.:
49852.62
Organism:
Rattus norvegicus (rat)
Description:
Rat cloned 5-HT7R.
Residue:
448
  
Inhibitor
Name:
BDBM82087
Synonyms:
2-(5-methoxy-1H-indol-3-yl)ethanamine 5-Methoxytryptamine hydrochloride tryptamine, 5-Methoxy
Type:
Small organic molecule
Emp. Form.:
C11H14N2O
Mol. Mass.:
190.2417
SMILES:
COc1ccc2[nH]cc(CCN)c2c1
: