Target
5-hydroxytryptamine receptor 7
Ligand
BDBM50024204
Substrate
Ki
21.1±n/a nM
Comments
PDSP_1206
Citation
 Shen, YMonsma, FJMetcalf, MAJose, PAHamblin, MWSibley, DR Molecular cloning and expression of a 5-hydroxytryptamine7 serotonin receptor subtype. J Biol Chem 268:18200-4 (1993) Target
Name:
5-hydroxytryptamine receptor 7
Synonyms:
5-HT-7 5-HT7 5-HT7S 5-hydroxytryptamine receptor 7 5HT7R_RAT GPRFO Serotonin (5-HT) receptor | Serotonin Receptor 7
Type:
G Protein-Coupled Receptor (GPCR)
Mol. Mass.:
49852.62
Organism:
Rattus norvegicus (rat)
Description:
Rat cloned 5-HT7R.
Residue:
448
  
Inhibitor
Name:
BDBM50024204
Synonyms:
1H-imidazo[4,5-c]pyridine derivative 4,7-dimethyl-(6aR,9S,10aR)-4,6,6a,7,8,9,10,10a-octahydroindolo[4,3-fg]quinolin-9-amino-N,N-dimethyl sulfonamide 9-N,N-dimethylsulfamide-4,7-dimethyl-4,6,6a,7,8,9,10,10a-octahydro-indolo[4,3-fg]quinoline ChEMBL_10959 N'-4,7-Dimethyl-4,6,6a,7,8,9,10,10a-octahydro-indolo[4,3-fg]quinolin-9-yl)-N'-,N'-dimethyl-sulphonediamine
Type:
Small organic molecule
Emp. Form.:
C18H26N4O2S
Mol. Mass.:
362.49
SMILES:
CN(C)S(=O)(=O)N[C@H]1C[C@H]2[C@@H](Cc3cn(C)c4cccc2c34)N(C)C1
: