Target
5-hydroxytryptamine receptor 6
Ligand
BDBM50031942
Substrate
Ki
12.58±n/a nM
Comments
PDSP_1230
Citation
 Plassat, JLAmlaiky, NHen, R Molecular cloning of a mammalian serotonin receptor that activates adenylate cyclase. Mol Pharmacol 44:229-36 (1993) Target
Name:
5-hydroxytryptamine receptor 6
Synonyms:
5-HT6 5HT6R_MOUSE | Htr6
Type:
Enzyme Catalytic Domain
Mol. Mass.:
47012.98
Organism:
MOUSE
Description:
5-HT6 HTR6 MOUSE::Q9R1C8
Residue:
440
  
Inhibitor
Name:
BDBM50031942
Synonyms:
(6aR,9R)-4,6a,7-Trimethyl-4,6,6a,7,8,9-hexahydro-indolo[4,3-fg]quinoline-9-carboxylic acid (1-hydroxymethyl-propyl)-amide (6aR,9R)-4-Methyl-4,6,6a,7,8,9-hexahydro-indolo[4,3-fg]quinoline-9-carboxylic acid (1-hydroxymethyl-propyl)-amide (methylsergide)4,7-Dimethyl-4,6,6a,7,8,9-hexahydro-indolo[4,3-fg]quinoline-9-carboxylic acid (1-hydroxymethyl-propyl)-amide CHEMBL1065 Sansert
Type:
Small organic molecule
Emp. Form.:
C21H27N3O2
Mol. Mass.:
353.458
SMILES:
CC[C@@H](CO)NC(=O)[C@H]1CN(C)[C@@H]2Cc3cn(C)c4cccc(C2=C1)c34
: