Target
Sigma non-opioid intracellular receptor 1
Ligand
BDBM50000066
Substrate
Meas. Tech.
ChEBML_226551
Ki
0.170000±n/a nM
Citation
 de Costa, BRRadesca, LDi Paolo, LBowen, WD Synthesis, characterization, and biological evaluation of a novel class of N-(arylethyl)-N-alkyl-2-(1-pyrrolidinyl)ethylamines: structural requirements and binding affinity at the sigma receptor. J Med Chem 35:38-47 (1992)  
Target
Name:
Sigma non-opioid intracellular receptor 1
Synonyms:
Aging-associated gene 8 protein SGMR1_HUMAN SIGMAR1 SR31747-binding protein Sigma 1-type opioid receptor Sigma1R | hSigmaR1
Type:
Enzyme Catalytic Domain
Mol. Mass.:
25124.85
Organism:
Homo sapiens (Human)
Description:
Q99720
Residue:
223
  
Inhibitor
Name:
BDBM50000066
Synonyms:
(2-Azepan-1-yl-ethyl)-[2-(3,4-dichloro-phenyl)-ethyl]-methyl-amine | CHEMBL356688
Type:
Small organic molecule
Emp. Form.:
C17H26Cl2N2
Mol. Mass.:
329.308
SMILES:
CN(CCN1CCCCCC1)CCc1ccc(Cl)c(Cl)c1
: