Target
D(2) dopamine receptor
Ligand
BDBM50000078
Substrate
Meas. Tech.
ChEBML_62074
Ki
1301±n/a nM
Citation
 de Costa, BRRadesca, LDi Paolo, LBowen, WD Synthesis, characterization, and biological evaluation of a novel class of N-(arylethyl)-N-alkyl-2-(1-pyrrolidinyl)ethylamines: structural requirements and binding affinity at the sigma receptor. J Med Chem 35:38-47 (1992)  
Target
Name:
D(2) dopamine receptor
Synonyms:
DOPAMINE D2 DOPAMINE D2 Short Dopamine D2 receptor Drd2
Type:
G Protein-Coupled Receptor (GPCR)
Mol. Mass.:
50931.60
Organism:
Rattus norvegicus (rat)
Description:
P61169
Residue:
444
  
Inhibitor
Name:
BDBM50000078
Synonyms:
(3,4-Dichloro-benzyl)-methyl-(2-pyrrolidin-1-yl-ethyl)-amine | CHEMBL143089
Type:
Small organic molecule
Emp. Form.:
C14H20Cl2N2
Mol. Mass.:
287.228
SMILES:
CN(CCN1CCCC1)Cc1ccc(Cl)c(Cl)c1
: