Target
G-protein coupled receptor 84
Ligand
BDBM50078850
Substrate
Meas. Tech.
ChEMBL_1665424 (CHEMBL4015220)
EC50
400±n/a nM
Citation
 Pillaiyar, TKöse, MSylvester, KWeighardt, HThimm, DBorges, GFörster, Ivon Kügelgen, IMüller, CE Diindolylmethane Derivatives: Potent Agonists of the Immunostimulatory Orphan G Protein-Coupled Receptor GPR84. J Med Chem 60:3636-3655 (2017)  
Target
Name:
G-protein coupled receptor 84
Synonyms:
EX33 GPR84 Inflammation-related G-protein coupled receptor EX33
Type:
PROTEIN
Mol. Mass.:
43726.73
Organism:
Homo sapiens (Human)
Description:
ChEMBL_116040
Residue:
396
  
Inhibitor
Name:
BDBM50078850
Synonyms:
CHEBI:4778 | Embelin
Type:
Small organic molecule
Emp. Form.:
C17H26O4
Mol. Mass.:
294.3859
SMILES:
CCCCCCCCCCCC1=C(O)C(=O)C=C(O)C1=O
: