Target
Potassium-transporting ATPase alpha chain 1
Ligand
BDBM50000199
Substrate
Meas. Tech.
ChEBML_76079
IC50
3000±n/a nM
Citation
 Weidmann, KHerling, AWLang, HJScheunemann, KHRippel, RNimmesgern, HScholl, TBickel, MMetzger, H 2-[(2-pyridylmethyl)sulfinyl]-1H-thieno[3,4-d]imidazoles. A novel class of gastric H+/K(+)-ATPase inhibitors. J Med Chem 35:438-50 (1992)  
Target
Name:
Potassium-transporting ATPase alpha chain 1
Synonyms:
ATP4A Gastric H(+)/K(+) ATPase subunit alpha Na/K-ATPase Potassium-transporting ATPase alpha chain 1 | Proton pump
Type:
Enzyme
Mol. Mass.:
114279.23
Organism:
Sus scrofa (Pig)
Description:
P19156
Residue:
1034
  
Inhibitor
Name:
BDBM50000199
Synonyms:
2-[3-Methoxy-4-(2,2,3,3-tetrafluoro-propoxy)-pyridin-2-ylmethanesulfinyl]-3H-thieno[3,4-d]imidazole | CHEMBL138555
Type:
Small organic molecule
Emp. Form.:
C15H13F4N3O3S2
Mol. Mass.:
423.406
SMILES:
COc1c(OCC(F)(F)C(F)F)ccnc1CS(=O)c1nc2cscc2[nH]1
: