Target
Carbonic anhydrase 2
Ligand
BDBM50239277
Substrate
Meas. Tech.
ChEMBL_1665868 (CHEMBL4015664)
Ki
0.290000±n/a nM
Citation
 Bruno, EBuemi, MRDi Fiore, ADe Luca, LFerro, SAngeli, ACirilli, RSadutto, DAlterio, VMonti, SMSupuran, CTDe Simone, GGitto, R Probing Molecular Interactions between Human Carbonic Anhydrases (hCAs) and a Novel Class of Benzenesulfonamides. J Med Chem 60:4316-4326 (2017)  
Target
Name:
Carbonic anhydrase 2
Synonyms:
CA-II CAC Carbonate dehydratase II Carbonic anhydrase 2 (CA-II) Carbonic anhydrase C Carbonic anhydrase II (CA-II) Carbonic anhydrase II (hCA II) | Carbonic anhydrase isoenzyme II (hCA II)
Type:
Enzyme
Mol. Mass.:
29250.71
Organism:
Homo sapiens (Human)
Description:
P00918
Residue:
260
  
Inhibitor
Name:
BDBM50239277
Synonyms:
CHEMBL4081248
Type:
Small organic molecule
Emp. Form.:
C22H19ClN2O5S
Mol. Mass.:
458.915
SMILES:
NS(=O)(=O)c1ccc(cc1)C(=O)N1CCc2cc(O)c(O)cc2C1c1ccc(Cl)cc1
: