Target
Voltage-dependent L-type calcium channel subunit alpha-1S
Ligand
BDBM50000357
Substrate
Meas. Tech.
ChEBML_53192
Kd
1400±n/a nM
Citation
 Kimball, SDFloyd, DMDas, JHunt, JTKrapcho, JRovnyak, GDuff, KJLee, VGMoquin, RVTurk, CF Benzazepinone calcium channel blockers. 4. Structure-activity overview and intracellular binding site. J Med Chem 35:780-93 (1992)  
Target
Name:
Voltage-dependent L-type calcium channel subunit alpha-1S
Synonyms:
CAC1S_HUMAN CACN1 CACNL1A3 Voltage-dependent L-type calcium channel subunit alpha-1S Voltage-gated L-type calcium channel alpha-1S subunit Voltage-gated calcium channel subunit alpha Cav1.1
Type:
PROTEIN
Mol. Mass.:
212348.33
Organism:
Homo sapiens (Human)
Description:
ChEMBL_42767
Residue:
1873
  
Inhibitor
Name:
BDBM50000357
Synonyms:
Acetic acid 7-chloro-1-(2-dimethylamino-ethyl)-4-(4-methoxy-phenyl)-2-oxo-2,3,4,5-tetrahydro-1H-benzo[b]azepin-3-yl ester CHEMBL315809
Type:
Small organic molecule
Emp. Form.:
C23H27ClN2O4
Mol. Mass.:
430.924
SMILES:
COc1ccc(cc1)[C@@H]1Cc2cc(Cl)ccc2N(CCN(C)C)C(=O)[C@@H]1OC(C)=O
: