Target
Anoctamin-1
Ligand
BDBM50239465
Substrate
Meas. Tech.
ChEMBL_1666074 (CHEMBL4015870)
IC50
77±n/a nM
Citation
 Truong, ECPhuan, PWReggi, ALFerrera, LGalietta, LJVLevy, SEMoises, ACCil, ODiez-Cecilia, ELee, SVerkman, ASAnderson, MO Substituted 2-Acylaminocycloalkylthiophene-3-carboxylic Acid Arylamides as Inhibitors of the Calcium-Activated Chloride Channel Transmembrane Protein 16A (TMEM16A). J Med Chem 60:4626-4635 (2017)  
Target
Name:
Anoctamin-1
Synonyms:
ANO1 DOG1 ORAOV2 TAOS2 Transmembrane protein 16A | Tumor-amplified and overexpressed sequence 2
Type:
PROTEIN
Mol. Mass.:
114103.63
Organism:
Homo sapiens (Human)
Description:
ChEMBL_828184
Residue:
986
  
Inhibitor
Name:
BDBM50239465
Synonyms:
CHEMBL4080525 | US11274074, Control [Ani9]
Type:
Small organic molecule
Emp. Form.:
C17H17ClN2O3
Mol. Mass.:
332.781
SMILES:
COc1ccccc1\C=N\NC(=O)COc1ccc(Cl)cc1C
: