Target
Mu-type opioid receptor
Ligand
BDBM50000509
Substrate
Meas. Tech.
ChEBML_149011
Ki
567±n/a nM
Citation
 Lazarus, LHSalvadori, SBalboni, GTomatis, RWilson, WE Stereospecificity of amino acid side chains in deltorphin defines binding to opioid receptors. J Med Chem 35:1222-7 (1992)  
Target
Name:
Mu-type opioid receptor
Synonyms:
MOR-1 Mu-type opioid receptor (MOR) OPRM_RAT Opioid receptor B Ror-b
Type:
G Protein-Coupled Receptor (GPCR)
Mol. Mass.:
44503.11
Organism:
Rattus norvegicus (rat)
Description:
Competition binding assays were carried out using membrane preparations from transfected HN9.10 cells that constitutively expressed the mu opioid receptor.
Residue:
398
  
Inhibitor
Name:
BDBM50000509
Synonyms:
3-{2-[2-(2-{2-[2-Amino-3-(4-hydroxy-phenyl)-propionylamino]-propionylamino}-3-phenyl-propionylamino)-4-methyl-pentanoylamino]-4-methylsulfanyl-butyrylamino}-succinamic acid | CHEMBL20422
Type:
Small organic molecule
Emp. Form.:
C36H51N7O9S
Mol. Mass.:
757.897
SMILES:
CSCC[C@H](NC(=O)[C@H](CC(C)C)NC(=O)[C@H](Cc1ccccc1)NC(=O)[C@@H](C)NC(=O)[C@@H](N)Cc1ccc(O)cc1)C(=O)N[C@@H](CC(O)=O)C(N)=O
: