Target
Delta-type opioid receptor
Ligand
BDBM50000509
Substrate
Meas. Tech.
ChEBML_217857
Ki
14±n/a nM
Citation
 Lazarus, LHSalvadori, SBalboni, GTomatis, RWilson, WE Stereospecificity of amino acid side chains in deltorphin defines binding to opioid receptors. J Med Chem 35:1222-7 (1992)  
Target
Name:
Delta-type opioid receptor
Synonyms:
Cytochrome P450 3A4 Delta opioid receptor Delta-type opioid receptor (DOR) OPRD_RAT Opioid receptor Opioid receptors; mu & delta Ror-a | Voltage-gated potassium channel
Type:
G Protein-Coupled Receptor (GPCR)
Mol. Mass.:
40465.04
Organism:
Rattus norvegicus (rat)
Description:
Competition binding assays were using CHO-K1 cell membranes expressing the opioid receptor.
Residue:
372
  
Inhibitor
Name:
BDBM50000509
Synonyms:
3-{2-[2-(2-{2-[2-Amino-3-(4-hydroxy-phenyl)-propionylamino]-propionylamino}-3-phenyl-propionylamino)-4-methyl-pentanoylamino]-4-methylsulfanyl-butyrylamino}-succinamic acid | CHEMBL20422
Type:
Small organic molecule
Emp. Form.:
C36H51N7O9S
Mol. Mass.:
757.897
SMILES:
CSCC[C@H](NC(=O)[C@H](CC(C)C)NC(=O)[C@H](Cc1ccccc1)NC(=O)[C@@H](C)NC(=O)[C@@H](N)Cc1ccc(O)cc1)C(=O)N[C@@H](CC(O)=O)C(N)=O
: