Target
Cytochrome P450 1A1
Ligand
BDBM50239593
Substrate
Meas. Tech.
ChEMBL_1666483 (CHEMBL4016279)
Ki
240.00±n/a nM
Citation
 Fortin, SCharest-Morin, XTurcotte, VLauvaux, CLacroix, JCôté, MFGobeil, SC-Gaudreault, R Activation of Phenyl 4-(2-Oxo-3-alkylimidazolidin-1-yl)benzenesulfonates Prodrugs by CYP1A1 as New Antimitotics Targeting Breast Cancer Cells. J Med Chem 60:4963-4982 (2017)  
Target
Name:
Cytochrome P450 1A1
Synonyms:
CP1A1_HUMAN CYPIA1 Cytochrome P450 1A1 P450 form 6 P450-P1
Type:
Protein
Mol. Mass.:
58177.23
Organism:
Homo sapiens (Human)
Description:
P04798
Residue:
512
  
Inhibitor
Name:
BDBM50239593
Synonyms:
CHEMBL4096550
Type:
Small organic molecule
Emp. Form.:
C21H26N2O7S
Mol. Mass.:
450.505
SMILES:
CCCN1CCN(C1=O)c1ccc(cc1)S(=O)(=O)Oc1cc(OC)c(OC)c(OC)c1
: