Target
11-beta-hydroxysteroid dehydrogenase 1
Ligand
BDBM50239606
Substrate
Meas. Tech.
ChEMBL_1666539 (CHEMBL4016335)
Ki
3.8±n/a nM
Citation
 Ye, XYChen, SYWu, SYoon, DSWang, HHong, ZO'Connor, SPLi, JLi, JJKennedy, LJWalker, SJNayeem, ASheriff, SCamac, DMRamamurthy, VMorin, PEZebo, RTaylor, JRMorgan, NNPonticiello, RPHarrity, TApedo, AGolla, RSeethala, RWang, MHarper, TWSleczka, BGHe, BKirby, MLeahy, DKLi, JHanson, RLGuo, ZLi, YXDiMarco, JDScaringe, RMaxwell, BMoulin, FBarrish, JCGordon, DARobl, JA Discovery of Clinical Candidate 2-((2S,6S)-2-Phenyl-6-hydroxyadamantan-2-yl)-1-(3'-hydroxyazetidin-1-yl)ethanone [BMS-816336], an Orally Active Novel Selective 11?-Hydroxysteroid Dehydrogenase Type 1 Inhibitor. J Med Chem 60:4932-4948 (2017)  
Target
Name:
11-beta-hydroxysteroid dehydrogenase 1
Synonyms:
11-DH 11-beta-Hydroxysteroid Dehydrogenase 1 (11-beta-HSD1) 11-beta-hydroxysteroid dehydrogenase 1 (11HSD1) Corticosteroid 11-beta-dehydrogenase isozyme 1 (11-beta-HSD-1) Corticosteroid 11-beta-dehydrogenase isozyme 1 (11beta-HSD1) HSD11 HSD11L | SDR26C1
Type:
Enzyme
Mol. Mass.:
32409.16
Organism:
Homo sapiens (Human)
Description:
P28845
Residue:
292
  
Inhibitor
Name:
BDBM50239606
Synonyms:
CHEMBL4080667
Type:
Small organic molecule
Emp. Form.:
C21H27NO3
Mol. Mass.:
341.444
SMILES:
OC1CN(C1)C(=O)CC1(C2CC3CC1CC(C2)[C@H]3O)c1ccccc1
: