Target
Glycogen synthase kinase-3 beta
Ligand
BDBM50239763
Substrate
Meas. Tech.
ChEMBL_1666888 (CHEMBL4016684)
IC50
>20000±n/a nM
Citation
 Palomo, VPerez, DIRoca, CAnderson, CRodríguez-Muela, NPerez, CMorales-Garcia, JAReyes, JACampillo, NEPerez-Castillo, AMRubin, LLTimchenko, LGil, CMartinez, A Subtly Modulating Glycogen Synthase Kinase 3?: Allosteric Inhibitor Development and Their Potential for the Treatment of Chronic Diseases. J Med Chem 60:4983-5001 (2017)  
Target
Name:
Glycogen synthase kinase-3 beta
Synonyms:
GSK-3 beta GSK3B Glycogen synthase kinase 3 beta (GSK3B) Glycogen synthase kinase-3 beta (GSK-3B) Glycogen synthase kinase-3 beta (GSK3B) Glycogen synthase kinase-3beta (GSK3B) | Serine/threonine-protein kinase GSK3B
Type:
Enzyme
Mol. Mass.:
46756.38
Organism:
Homo sapiens (Human)
Description:
P49841
Residue:
420
  
Inhibitor
Name:
BDBM50239763
Synonyms:
CHEMBL4079175
Type:
Small organic molecule
Emp. Form.:
C26H39N3O4
Mol. Mass.:
457.6056
SMILES:
CCCCCCCCCCCC(=O)NNC(=O)c1c(O)c2ccccc2n(CC(C)C)c1=O
: