Target
P2Y purinoceptor 12
Ligand
BDBM50000895
Substrate
Meas. Tech.
ChEMBL_89718 (CHEMBL696421)
EC50
>100000±n/a nM
Citation
 Meanwell, NAPearce, BCRoth, HRSmith, ECWedding, DLWright, JJBuchanan, JOBaryla, UMGamberdella, MGillespie, E Inhibitors of blood platelet cAMP phosphodiesterase. 2. Structure-activity relationships associated with 1,3-dihydro-2H-imidazo[4,5-b]quinolin-2-ones substituted with functionalized side chains. J Med Chem 35:2672-87 (1992)  
Target
Name:
P2Y purinoceptor 12
Synonyms:
ADP-glucose receptor HORK3 P2T(AC) P2Y(AC) P2Y(cyc) P2Y12 platelet ADP receptor Purinergic receptor P2Y12 | SP1999
Type:
Enzyme
Mol. Mass.:
39458.48
Organism:
Homo sapiens (Human)
Description:
Q9H244
Residue:
342
  
Inhibitor
Name:
BDBM50000895
Synonyms:
4-(1,3-Dimethyl-2-oxo-2,3-dihydro-1H-imidazo[4,5-b]quinolin-7-yloxy)-butyric acid | CHEMBL91579
Type:
Small organic molecule
Emp. Form.:
C16H17N3O4
Mol. Mass.:
315.3239
SMILES:
Cn1c2cc3cc(OCCCC(O)=O)ccc3nc2n(C)c1=O
: