Target
E3 ubiquitin-protein ligase Mdm2
Ligand
BDBM29643
Substrate
Meas. Tech.
ChEMBL_1668047 (CHEMBL4017935)
IC50
175±n/a nM
Citation
 Ishiba, HNoguchi, TShu, KOhno, HHonda, KKondoh, YOsada, HFujii, NOishi, S Investigation of the inhibitory mechanism of apomorphine against MDM2-p53 interaction. Bioorg Med Chem Lett 27:2571-2574 (2017)  
Target
Name:
E3 ubiquitin-protein ligase Mdm2
Synonyms:
Double minute 2 protein E3 ubiquitin-protein ligase Mdm2 (p53-binding protein Mdm2) Human Double Minute 2 (HDM2) MDM2-MDMX p53-Binding Protein MDM2 | p53-binding protein
Type:
Oncoprotein
Mol. Mass.:
55196.54
Organism:
Homo sapiens (Human)
Description:
Q00987
Residue:
491
  
Inhibitor
Name:
BDBM29643
Synonyms:
(6aS)-6-methyl-5,6,6a,7-tetrahydro-4H-dibenzo[de,g]quinoline-10,11-diol;hydrochloride Apomorphine,(+) MLS000028867 SMR000058671 cid_6852389
Type:
Small organic molecule
Emp. Form.:
C17H17NO2
Mol. Mass.:
267.3224
SMILES:
CN1CCc2cccc-3c2[C@@H]1Cc1ccc(O)c(O)c-31
: