Target
Glucose-dependent insulinotropic receptor
Ligand
BDBM29080
Substrate
Meas. Tech.
ChEMBL_1668157 (CHEMBL4018045)
EC50
2200±n/a nM
Citation
 Yang, ZFang, YPark, H Synthesis and biological evaluation of pyrimidine derivatives with diverse azabicyclic ether/amine as novel GPR119 agonist. Bioorg Med Chem Lett 27:2515-2519 (2017)  
Target
Name:
Glucose-dependent insulinotropic receptor
Synonyms:
G-protein coupled receptor 119 (GPR119) GPR119 | Glucose-dependent insulinotropic receptor
Type:
Protein
Mol. Mass.:
36901.49
Organism:
Homo sapiens (Human)
Description:
Q8TDV5
Residue:
335
  
Inhibitor
Name:
BDBM29080
Synonyms:
CHEMBL280065 Oleamide MEA Oleoylethanolamide (OEA)
Type:
Emp. Form.:
C20H39NO2
Mol. Mass.:
325.5292
SMILES:
CCCCCCCC\C=C/CCCCCCCC(=O)NCCO
: