Target
Peptidyl-prolyl cis-trans isomerase FKBP1A
Ligand
BDBM50240521
Substrate
Meas. Tech.
ChEMBL_1668291 (CHEMBL4018179)
IC50
11±n/a nM
Citation
 Nambu, MCovel, JAKapoor, MLi, XMoloney, MKNuma, MMSoltow, QATrzoss, MWebb, PWebb, RRMutz, M A calcineurin antifungal strategy with analogs of FK506. Bioorg Med Chem Lett 27:2465-2471 (2017)  
Target
Name:
Peptidyl-prolyl cis-trans isomerase FKBP1A
Synonyms:
12 kDa FK506-binding protein FK506-binding protein 1A FKB1A_HUMAN FKBP-1A FKBP12 Immunophilin FKBP12 PPIase FKBP1A Rotamase mTOR/FKBP12A/FKBP12B
Type:
Isomerase
Mol. Mass.:
11953.09
Organism:
Homo sapiens (Human)
Description:
P62942
Residue:
108
  
Inhibitor
Name:
BDBM50240521
Synonyms:
CHEMBL4095348
Type:
Small organic molecule
Emp. Form.:
C55H84N4O13
Mol. Mass.:
1009.2745
SMILES:
[H][C@]12O[C@](O)([C@H](C)C[C@@H]1OC)C(=O)C(=O)N1CCCC[C@@]1([H])C(=O)O[C@@H]([C@H](C)[C@@H](O)CC(=O)[C@H](CCCC(=O)N1CCN(Cc3ccccn3)CC1)\C=C(C)\C[C@H](C)C[C@@H]2OC)C(\C)=C\[C@@H]1CC[C@@H](O)[C@@H](C1)OC
: