Target
Oxytocin receptor
Ligand
BDBM50001367
Substrate
Meas. Tech.
ChEBML_149059
IC50
>100000±n/a nM
Citation
 Evans, BELeighton, JLRittle, KEGilbert, KFLundell, GFGould, NPHobbs, DWDiPardo, RMVeber, DFPettibone, DJ Orally active, nonpeptide oxytocin antagonists. J Med Chem 35:3919-27 (1992)  
Target
Name:
Oxytocin receptor
Synonyms:
OT-R Otr Oxytocin
Type:
Enzyme Catalytic Domain
Mol. Mass.:
42889.28
Organism:
RAT
Description:
Oxytocin OXTR RAT::P70536
Residue:
388
  
Inhibitor
Name:
BDBM50001367
Synonyms:
1'-(4-methylphenylsulfonyl)spiro[9H-fluorene-9,4'-(hexahydropyridine)] | CHEMBL339472
Type:
Small organic molecule
Emp. Form.:
C24H23NO2S
Mol. Mass.:
389.51
SMILES:
Cc1ccc(cc1)S(=O)(=O)N1CCC2(CC1)c1ccccc1-c1ccccc21
: