Target
Oxytocin receptor
Ligand
BDBM50001371
Substrate
Meas. Tech.
ChEBML_149059
IC50
>10000±n/a nM
Citation
 Evans, BELeighton, JLRittle, KEGilbert, KFLundell, GFGould, NPHobbs, DWDiPardo, RMVeber, DFPettibone, DJ Orally active, nonpeptide oxytocin antagonists. J Med Chem 35:3919-27 (1992)  
Target
Name:
Oxytocin receptor
Synonyms:
OT-R Otr Oxytocin
Type:
Enzyme Catalytic Domain
Mol. Mass.:
42889.28
Organism:
RAT
Description:
Oxytocin OXTR RAT::P70536
Residue:
388
  
Inhibitor
Name:
BDBM50001371
Synonyms:
3,3-dimethyl-1-spiro[2,3-dihydro-1H-indene-1,4'-(hexahydropyridine)]-1-ylsulfonylmethylbicyclo[2.2.1]heptan-2-one | CHEMBL126029
Type:
Small organic molecule
Emp. Form.:
C23H31NO3S
Mol. Mass.:
401.562
SMILES:
CC1(C)C2CC[C@](CS(=O)(=O)N3CCC4(CCc5ccccc45)CC3)(C2)C1=O
: