Target
Oxytocin receptor
Ligand
BDBM50001401
Substrate
Meas. Tech.
ChEBML_149059
IC50
3000±n/a nM
Citation
 Evans, BELeighton, JLRittle, KEGilbert, KFLundell, GFGould, NPHobbs, DWDiPardo, RMVeber, DFPettibone, DJ Orally active, nonpeptide oxytocin antagonists. J Med Chem 35:3919-27 (1992)  
Target
Name:
Oxytocin receptor
Synonyms:
OT-R Otr Oxytocin
Type:
Enzyme Catalytic Domain
Mol. Mass.:
42889.28
Organism:
RAT
Description:
Oxytocin OXTR RAT::P70536
Residue:
388
  
Inhibitor
Name:
BDBM50001401
Synonyms:
CHEMBL126565 | methyl 2-spiro[1H-indene-1,4'-(hexahydropyridine)]-1-ylsulfonylbenzoate
Type:
Small organic molecule
Emp. Form.:
C21H21NO4S
Mol. Mass.:
383.461
SMILES:
COC(=O)c1ccccc1S(=O)(=O)N1CCC2(CC1)C=Cc1ccccc21
: