Target
Oxytocin receptor
Ligand
BDBM50001425
Substrate
Meas. Tech.
ChEBML_149059
IC50
10000±n/a nM
Citation
 Evans, BELeighton, JLRittle, KEGilbert, KFLundell, GFGould, NPHobbs, DWDiPardo, RMVeber, DFPettibone, DJ Orally active, nonpeptide oxytocin antagonists. J Med Chem 35:3919-27 (1992)  
Target
Name:
Oxytocin receptor
Synonyms:
OT-R Otr Oxytocin
Type:
Enzyme Catalytic Domain
Mol. Mass.:
42889.28
Organism:
RAT
Description:
Oxytocin OXTR RAT::P70536
Residue:
388
  
Inhibitor
Name:
BDBM50001425
Synonyms:
1'N-(2-adamantyl)spiro[1H-indene-1,4'-(hexahydropyridine)]-1'-carboxamide | CHEMBL127119
Type:
Small organic molecule
Emp. Form.:
C24H30N2O
Mol. Mass.:
362.5078
SMILES:
O=C(NC1C2CC3CC(C2)CC1C3)N1CCC2(CC1)C=Cc1ccccc21
: