Target
Oxytocin receptor
Ligand
BDBM50001345
Substrate
Meas. Tech.
ChEBML_149059
IC50
>10000±n/a nM
Citation
 Evans, BELeighton, JLRittle, KEGilbert, KFLundell, GFGould, NPHobbs, DWDiPardo, RMVeber, DFPettibone, DJ Orally active, nonpeptide oxytocin antagonists. J Med Chem 35:3919-27 (1992)  
Target
Name:
Oxytocin receptor
Synonyms:
OT-R Otr Oxytocin
Type:
Enzyme Catalytic Domain
Mol. Mass.:
42889.28
Organism:
RAT
Description:
Oxytocin OXTR RAT::P70536
Residue:
388
  
Inhibitor
Name:
BDBM50001345
Synonyms:
1'-(3-methylphenylsulfonyl)spiro[1H-indene-1,4'-(hexahydropyridine)] | CHEMBL125350
Type:
Small organic molecule
Emp. Form.:
C20H21NO2S
Mol. Mass.:
339.451
SMILES:
Cc1cccc(c1)S(=O)(=O)N1CCC2(CC1)C=Cc1ccccc21
: