Target
Oxytocin receptor
Ligand
BDBM50001378
Substrate
Meas. Tech.
ChEBML_149059
IC50
>10000±n/a nM
Citation
 Evans, BELeighton, JLRittle, KEGilbert, KFLundell, GFGould, NPHobbs, DWDiPardo, RMVeber, DFPettibone, DJ Orally active, nonpeptide oxytocin antagonists. J Med Chem 35:3919-27 (1992)  
Target
Name:
Oxytocin receptor
Synonyms:
OT-R Otr Oxytocin
Type:
Enzyme Catalytic Domain
Mol. Mass.:
42889.28
Organism:
RAT
Description:
Oxytocin OXTR RAT::P70536
Residue:
388
  
Inhibitor
Name:
BDBM50001378
Synonyms:
1'-(4-nitrobenzylsulfonyl)spiro[1H-indene-1,4'-(hexahydropyridine)] | CHEMBL338814
Type:
Small organic molecule
Emp. Form.:
C20H20N2O4S
Mol. Mass.:
384.449
SMILES:
[O-][N+](=O)c1ccc(CS(=O)(=O)N2CCC3(CC2)C=Cc2ccccc32)cc1
: