Target
Mu-type opioid receptor
Ligand
BDBM50001456
Substrate
Meas. Tech.
ChEBML_149135
Ki
117±n/a nM
Citation
 Schiller, PWWeltrowska, GNguyen, TMWilkes, BCChung, NNLemieux, C Conformationally restricted deltorphin analogues. J Med Chem 35:3956-61 (1992)  
Target
Name:
Mu-type opioid receptor
Synonyms:
MOR-1 Mu-type opioid receptor (MOR) OPRM_RAT Opioid receptor B Ror-b
Type:
G Protein-Coupled Receptor (GPCR)
Mol. Mass.:
44503.11
Organism:
Rattus norvegicus (rat)
Description:
Competition binding assays were carried out using membrane preparations from transfected HN9.10 cells that constitutively expressed the mu opioid receptor.
Residue:
398
  
Inhibitor
Name:
BDBM50001456
Synonyms:
3-(2-{2-[2-(2-{2-[2-Amino-3-(4-hydroxy-phenyl)-propionylamino]-hexanoylamino}-3-phenyl-propionylamino)-3-(3H-imidazol-4-yl)-propionylamino]-4-methyl-pentanoylamino}-hexanoylamino)-succinamic acid | CHEMBL436590
Type:
Small organic molecule
Emp. Form.:
C46H66N10O10
Mol. Mass.:
919.0772
SMILES:
CCCC[C@@H](NC(=O)[C@@H](N)Cc1ccc(O)cc1)C(=O)N[C@@H](Cc1ccccc1)C(=O)N[C@@H](Cc1cnc[nH]1)C(=O)N[C@@H](CC(C)C)C(=O)N[C@@H](CCCC)C(=O)N[C@@H](CC(O)=O)C(N)=O
: