Target
Mu-type opioid receptor
Ligand
BDBM50001461
Substrate
Meas. Tech.
ChEBML_73269
IC50
380±n/a nM
Citation
 Schiller, PWWeltrowska, GNguyen, TMWilkes, BCChung, NNLemieux, C Conformationally restricted deltorphin analogues. J Med Chem 35:3956-61 (1992)  
Target
Name:
Mu-type opioid receptor
Synonyms:
M-OR-1 Mu opioid receptor OPIATE Mu OPRM_CAVPO
Type:
Enzyme Catalytic Domain
Mol. Mass.:
11165.58
Organism:
GUINEA PIG
Description:
P97266
Residue:
98
  
Inhibitor
Name:
BDBM50001461
Synonyms:
CHEMBL338466 | {23-[2-Amino-3-(4-hydroxy-phenyl)-propionylamino]-2-benzyl-14-carbamoyl-8,11-diisopropyl-3,6,9,12,17,24-hexaoxo-1,4,7,10,13,18hexaaza-cyclotetracos-5-yl}-acetic acid
Type:
Small organic molecule
Emp. Form.:
C43H61N9O11
Mol. Mass.:
879.9981
SMILES:
CC(C)[C@@H]1NC(=O)[C@@H](CC(O)=O)NC(=O)[C@H](Cc2ccccc2)NC(=O)[C@@H](CCCCNC(=O)CC[C@@H](NC(=O)[C@H](NC1=O)C(C)C)C(N)=O)NC(=O)[C@@H](N)Cc1ccc(O)cc1
: