Target
Leukotriene B4 receptor 1
Ligand
BDBM50001624
Substrate
Meas. Tech.
ChEBML_99486
IC50
800±n/a nM
Citation
 Labaudinière, RHendel, WTerlain, BCavy, FMarquis, ODereu, N omega-[(4-Phenyl-2-quinolyl)oxy]alkanoic acid derivatives: a new family of potent LTB4 antagonists. J Med Chem 35:4306-14 (1992)  
Target
Name:
Leukotriene B4 receptor 1
Synonyms:
BLT BLTR Chemoattractant receptor-like 1 GPR16 LTB4-R 1 Leukotriene B4 R1 Leukotriene B4 receptor 1 P2Y purinoceptor 7 | P2Y7
Type:
Enzyme Catalytic Domain
Mol. Mass.:
37582.68
Organism:
Homo sapiens (Human)
Description:
Q15722
Residue:
352
  
Inhibitor
Name:
BDBM50001624
Synonyms:
6-[4-(2-Fluoro-phenyl)-quinolin-2-yloxy]-2,2-dimethyl-hexanoic acid | CHEMBL345047
Type:
Small organic molecule
Emp. Form.:
C23H24FNO3
Mol. Mass.:
381.44
SMILES:
CC(C)(CCCCOc1cc(-c2ccccc2F)c2ccccc2n1)C(O)=O
: