Target
Glutamate carboxypeptidase 2
Ligand
BDBM50180951
Substrate
Meas. Tech.
ChEMBL_1668933 (CHEMBL4018821)
IC50
40±n/a nM
Citation
 Rais, RVávra, JTichý, TDash, RPGadiano, AJTenora, LMonincová, LBa?inka, CAlt, JZimmermann, SCSlusher, CEWu, YWozniak, KMajer, PTsukamoto, TSlusher, BS Discovery of a para-Acetoxy-benzyl Ester Prodrug of a Hydroxamate-Based Glutamate Carboxypeptidase II Inhibitor as Oral Therapy for Neuropathic Pain. J Med Chem 60:7799-7809 (2017)  
Target
Name:
Glutamate carboxypeptidase 2
Synonyms:
FGCP FOLH1 Folate hydrolase 1 Glutamate carboxypeptidase 2 Membrane glutamate carboxypeptidase NAALAD1 PSM Prostate-specific membrane antigen mGCP
Type:
PROTEIN
Mol. Mass.:
84333.66
Organism:
Homo sapiens (Human)
Description:
ChEMBL_1497035
Residue:
750
  
Inhibitor
Name:
BDBM50180951
Synonyms:
CHEMBL3818465
Type:
Small organic molecule
Emp. Form.:
C13H15NO6
Mol. Mass.:
281.2613
SMILES:
ONC(=O)CCC(Cc1ccc(cc1)C(O)=O)C(O)=O
: