Target
Neuropeptide Y receptor type 2
Ligand
BDBM50240829
Substrate
Meas. Tech.
ChEMBL_1668994 (CHEMBL4018882)
EC50
0.063096±n/a nM
Citation
 Schubert, MStichel, JDu, YTough, IRSliwoski, GMeiler, JCox, HMWeaver, CDBeck-Sickinger, AG Identification and Characterization of the First Selective Y J Med Chem 60:7605-7612 (2017)  
Target
Name:
Neuropeptide Y receptor type 2
Synonyms:
NPY-Y2 NPY2-R NPY2R_HUMAN Y2 receptor | neuropeptide Y receptor Y2
Type:
Enzyme Catalytic Domain
Mol. Mass.:
42734.65
Organism:
Homo sapiens (Human)
Description:
NPY-Y2 NPY2R HUMAN::P49146
Residue:
381
  
Inhibitor
Name:
BDBM50240829
Synonyms:
CHEMBL3559801
Type:
Small organic molecule
Emp. Form.:
C16H24O2
Mol. Mass.:
248.3606
SMILES:
CC(C)(C)c1ccc(OC2CCCCC2O)cc1
: