Target
Heat shock protein 75 kDa, mitochondrial
Ligand
BDBM50180302
Substrate
Meas. Tech.
ChEMBL_1669207 (CHEMBL4019095)
IC50
257±n/a nM
Citation
 Park, HKJeong, HKo, ELee, GLee, JELee, SKLee, AJIm, JYHu, SKim, SHLee, JHLee, CKang, SKang, BH Paralog Specificity Determines Subcellular Distribution, Action Mechanism, and Anticancer Activity of TRAP1 Inhibitors. J Med Chem 60:7569-7578 (2017)  
Target
Name:
Heat shock protein 75 kDa, mitochondrial
Synonyms:
HSP75 TRAP1_HUMAN
Type:
PROTEIN
Mol. Mass.:
80120.13
Organism:
Homo sapiens (Human)
Description:
ChEMBL_1478164
Residue:
704
  
Inhibitor
Name:
BDBM50180302
Synonyms:
8-(6-iodo-benzo[1,3]dioxol-5-ylsulfanyl)-9-(3-isopropylamino-propyl)adenine 8-[(6-IODO-1,3-BENZODIOXOL-5-YL)THIO]-9-[3-(ISOPROPYLAMINO)PROPYL]-9H-PURIN-6-AMINE US10336757, Compound PU-H71 | US10676476, Example 9
Type:
Small organic molecule
Emp. Form.:
C18H21IN6O2S
Mol. Mass.:
512.368
SMILES:
CC(C)NCCCn1c(Sc2cc3OCOc3cc2I)nc2c(N)ncnc12
: