Target
Delta-type opioid receptor
Ligand
BDBM50001720
Substrate
Meas. Tech.
ChEBML_146597
Ki
101±n/a nM
Citation
 Salvadori, SBianchi, CLazarus, LHScaranari, VAttila, MTomatis, R Para-substituted Phe3 deltorphin analogues: enhanced selectivity of halogenated derivatives for delta opioid receptor sites. J Med Chem 35:4651-7 (1993)  
Target
Name:
Delta-type opioid receptor
Synonyms:
Cytochrome P450 3A4 Delta opioid receptor Delta-type opioid receptor (DOR) OPRD_RAT Opioid receptor Opioid receptors; mu & delta Ror-a | Voltage-gated potassium channel
Type:
G Protein-Coupled Receptor (GPCR)
Mol. Mass.:
40465.04
Organism:
Rattus norvegicus (rat)
Description:
Competition binding assays were using CHO-K1 cell membranes expressing the opioid receptor.
Residue:
372
  
Inhibitor
Name:
BDBM50001720
Synonyms:
4-[2-{2-[2-Amino-3-(4-hydroxy-phenyl)-propionylamino]-propionylamino}-3-(4-nitro-phenyl)-propionylamino]-4-{1-[1-(carbamoylmethyl-carbamoyl)-2-methyl-propylcarbamoyl]-2-methyl-propylcarbamoyl}-butyric acid | CHEMBL143354
Type:
Small organic molecule
Emp. Form.:
C38H53N9O12
Mol. Mass.:
827.8805
SMILES:
CC(C)[C@H](NC(=O)[C@@H](NC(=O)[C@H](CCC(O)=O)NC(=O)[C@H](Cc1ccc(cc1)[N+]([O-])=O)NC(=O)[C@@H](C)NC(=O)[C@@H](N)Cc1ccc(O)cc1)C(C)C)C(=O)NCC(N)=O
: