Target
Mitogen-activated protein kinase 14
Ligand
BDBM50241016
Substrate
Meas. Tech.
ChEMBL_1669514 (CHEMBL4019402)
IC50
0.500000±n/a nM
Citation
 Walter, NMWentsch, HKBührmann, MBauer, SMDöring, EMayer-Wrangowski, SSievers-Engler, AWillemsen-Seegers, NZaman, GBuijsman, RLämmerhofer, MRauh, DLaufer, SA Design, Synthesis, and Biological Evaluation of Novel Type I J Med Chem 60:8027-8054 (2017)  
Target
Name:
Mitogen-activated protein kinase 14
Synonyms:
CSAID-binding protein CSBP1 CSPB1 MAP kinase 14 MAP kinase p38 alpha MAPK14 MK14_HUMAN Mitogen-activated protein kinase p38 alpha Stress-activated protein kinase 2a | p38 MAP kinase alpha/beta
Type:
Serine/threonine-protein kinase
Mol. Mass.:
41286.76
Organism:
Homo sapiens (Human)
Description:
Q16539
Residue:
360
  
Inhibitor
Name:
BDBM50241016
Synonyms:
CHEMBL4077602
Type:
Small organic molecule
Emp. Form.:
C30H24FN3O3
Mol. Mass.:
493.5283
SMILES:
CNC(=O)c1ccc2CCc3cc(Nc4ccc(F)c(NC(=O)c5ccccc5)c4)ccc3C(=O)c2c1
: