Target
Mitogen-activated protein kinase 14
Ligand
BDBM50241041
Substrate
Meas. Tech.
ChEMBL_1669514 (CHEMBL4019402)
IC50
24±n/a nM
Citation
 Walter, NMWentsch, HKBührmann, MBauer, SMDöring, EMayer-Wrangowski, SSievers-Engler, AWillemsen-Seegers, NZaman, GBuijsman, RLämmerhofer, MRauh, DLaufer, SA Design, Synthesis, and Biological Evaluation of Novel Type I J Med Chem 60:8027-8054 (2017)  
Target
Name:
Mitogen-activated protein kinase 14
Synonyms:
CSAID-binding protein CSBP1 CSPB1 MAP kinase 14 MAP kinase p38 alpha MAPK14 MK14_HUMAN Mitogen-activated protein kinase p38 alpha Stress-activated protein kinase 2a | p38 MAP kinase alpha/beta
Type:
Serine/threonine-protein kinase
Mol. Mass.:
41286.76
Organism:
Homo sapiens (Human)
Description:
Q16539
Residue:
360
  
Inhibitor
Name:
BDBM50241041
Synonyms:
CHEMBL4072511
Type:
Small organic molecule
Emp. Form.:
C27H24FN3O5
Mol. Mass.:
489.495
SMILES:
OCCNC(=O)c1ccc2COc3cc(Nc4ccc(F)c(NC(=O)C5CC5)c4)ccc3C(=O)c2c1
: