Target
D(2) dopamine receptor
Ligand
BDBM50001989
Substrate
Meas. Tech.
ChEBML_61411
IC50
1.6±n/a nM
Citation
 Perregaard, JArnt, JBøgesø, KPHyttel, JSánchez, C Noncataleptogenic, centrally acting dopamine D-2 and serotonin 5-HT2 antagonists within a series of 3-substituted 1-(4-fluorophenyl)-1H-indoles. J Med Chem 35:1092-101 (1992)  
Target
Name:
D(2) dopamine receptor
Synonyms:
DOPAMINE D2 DOPAMINE D2 Short Dopamine D2 receptor Drd2
Type:
G Protein-Coupled Receptor (GPCR)
Mol. Mass.:
50931.60
Organism:
Rattus norvegicus (rat)
Description:
P61169
Residue:
444
  
Inhibitor
Name:
BDBM50001989
Synonyms:
1-(4-Fluoro-phenyl)-3-(1-methyl-1,2,3,6-tetrahydro-pyridin-4-yl)-1H-indole | CHEMBL417614
Type:
Small organic molecule
Emp. Form.:
C20H19FN2
Mol. Mass.:
306.3767
SMILES:
CN1CCC(=CC1)c1cn(-c2ccc(F)cc2)c2ccccc12
: