Target
D(2) dopamine receptor
Ligand
BDBM50001991
Substrate
Meas. Tech.
ChEBML_61411
IC50
6.5±n/a nM
Citation
 Perregaard, JArnt, JBøgesø, KPHyttel, JSánchez, C Noncataleptogenic, centrally acting dopamine D-2 and serotonin 5-HT2 antagonists within a series of 3-substituted 1-(4-fluorophenyl)-1H-indoles. J Med Chem 35:1092-101 (1992)  
Target
Name:
D(2) dopamine receptor
Synonyms:
DOPAMINE D2 DOPAMINE D2 Short Dopamine D2 receptor Drd2
Type:
G Protein-Coupled Receptor (GPCR)
Mol. Mass.:
50931.60
Organism:
Rattus norvegicus (rat)
Description:
P61169
Residue:
444
  
Inhibitor
Name:
BDBM50001991
Synonyms:
1-(2-{4-[5-Chloro-1-(4-fluoro-phenyl)-1H-indol-3-yl]-piperidin-1-yl}-ethyl)-3-methyl-imidazolidin-2-one | CHEMBL275496
Type:
Small organic molecule
Emp. Form.:
C25H28ClFN4O
Mol. Mass.:
454.967
SMILES:
CN1CCN(CCN2CCC(CC2)c2cn(-c3ccc(F)cc3)c3ccc(Cl)cc23)C1=O
: