Target
Nuclear receptor corepressor 1
Ligand
BDBM19149
Substrate
Meas. Tech.
ChEMBL_1669865 (CHEMBL4019753)
IC50
51±n/a nM
Citation
 Dong, GChen, WWang, XYang, XXu, TWang, PZhang, WRao, YMiao, CSheng, C Small Molecule Inhibitors Simultaneously Targeting Cancer Metabolism and Epigenetics: Discovery of Novel Nicotinamide Phosphoribosyltransferase (NAMPT) and Histone Deacetylase (HDAC) Dual Inhibitors. J Med Chem 60:7965-7983 (2017)  
Target
Name:
Nuclear receptor corepressor 1
Synonyms:
KIAA1047 N-CoR1 NCOR1_HUMAN
Type:
PROTEIN
Mol. Mass.:
270226.27
Organism:
Homo sapiens (Human)
Description:
ChEMBL_107910
Residue:
2440
  
Inhibitor
Name:
BDBM19149
Synonyms:
CHEMBL98 SAHA US10188756, Compound SAHA US11505523, Compound SAHA US9353061, SAHA US9695181, Vorinostat Zolinza suberoylanilide hydroxamic acid
Type:
Small organic molecule
Emp. Form.:
C14H20N2O3
Mol. Mass.:
264.3202
SMILES:
ONC(=O)CCCCCCC(=O)Nc1ccccc1
: