Target
Lysine-specific histone demethylase 1A
Ligand
BDBM50241533
Substrate
Meas. Tech.
ChEMBL_1669916 (CHEMBL4019804)
Kd
32±n/a nM
Citation
 Mould, DPAlli, CBremberg, UCartic, SJordan, AMGeitmann, MMaiques-Diaz, AMcGonagle, AESomervaille, TCPSpencer, GJTurlais, FOgilvie, D Development of (4-Cyanophenyl)glycine Derivatives as Reversible Inhibitors of Lysine Specific Demethylase 1. J Med Chem 60:7984-7999 (2017)  
Target
Name:
Lysine-specific histone demethylase 1A
Synonyms:
AOF2 Flavin-containing amine oxidase domain-containing protein 2 KDM1A KIAA0601 Lysine-specific demethylase 1 (LSD1) Lysine-specific histone demethylase 1 (LSD1)
Type:
Enzyme
Mol. Mass.:
92901.01
Organism:
Homo sapiens (Human)
Description:
O60341
Residue:
852
  
Inhibitor
Name:
BDBM50241533
Synonyms:
CHEMBL4102775
Type:
Small organic molecule
Emp. Form.:
C24H27FN4O2
Mol. Mass.:
422.4952
SMILES:
COc1ccc(CN(CC(=O)N2CCC3(CNC3)CC2)c2ccc(cc2)C#N)cc1F
: