Target
Bromodomain-containing protein 4
Ligand
BDBM50241749
Substrate
Meas. Tech.
ChEMBL_1670329 (CHEMBL4020217)
Ki
3.4±n/a nM
Citation
 McDaniel, KFWang, LSoltwedel, TFidanze, SDHasvold, LALiu, DMantei, RAPratt, JKSheppard, GSBui, MHFaivre, EJHuang, XLi, LLin, XWang, RWarder, SEWilcox, DAlbert, DHMagoc, TJRajaraman, GPark, CHHutchins, CWShen, JJEdalji, RPSun, CCMartin, RGao, WWong, SFang, GElmore, SWShen, YKati, WM Discovery of N-(4-(2,4-Difluorophenoxy)-3-(6-methyl-7-oxo-6,7-dihydro-1H-pyrrolo[2,3-c]pyridin-4-yl)phenyl)ethanesulfonamide (ABBV-075/Mivebresib), a Potent and Orally Available Bromodomain and Extraterminal Domain (BET) Family Bromodomain Inhibitor. J Med Chem 60:8369-8384 (2017)  
Target
Name:
Bromodomain-containing protein 4
Synonyms:
BRD4 Bromodomain-containing protein 4 (BRD4) Protein HUNK1
Type:
Protein
Mol. Mass.:
152264.84
Organism:
Homo sapiens (Human)
Description:
O60885
Residue:
1362
  
Inhibitor
Name:
BDBM50241749
Synonyms:
CHEMBL4098055
Type:
Small organic molecule
Emp. Form.:
C22H20ClN3O4S
Mol. Mass.:
457.93
SMILES:
CCS(=O)(=O)Nc1ccc(Oc2ccc(Cl)cc2)c(c1)-c1cn(C)c(=O)c2[nH]ccc12
: