Target
Acetylcholinesterase
Ligand
BDBM50246566
Substrate
Meas. Tech.
ChEMBL_1676710 (CHEMBL4026853)
Kd
11500±n/a nM
Citation
 de Koning, MCJoosen, MJAWorek, FNachon, Fvan Grol, MKlaassen, SDAlkema, DPWWille, Tde Bruijn, HM Application of the Ugi Multicomponent Reaction in the Synthesis of Reactivators of Nerve Agent Inhibited Acetylcholinesterase. J Med Chem 60:9376-9392 (2017)  
Target
Name:
Acetylcholinesterase
Synonyms:
ACES_HUMAN Acetylcholinesterase (AChE) | Acetylcholinesterase (human AChE)
Type:
Enzyme
Mol. Mass.:
67792.70
Organism:
Homo sapiens (Human)
Description:
P22303
Residue:
614
  
Inhibitor
Name:
BDBM50246566
Synonyms:
CHEMBL4079076
Type:
Small organic molecule
Emp. Form.:
C14H16Cl2N4O3
Mol. Mass.:
359.208
SMILES:
[Cl-].[Cl-].NC(=O)c1cc[n+](COC[n+]2ccc(\C=N\O)cc2)cc1
: