Target
Adenosine receptor A2b
Ligand
BDBM50242134
Substrate
Meas. Tech.
ChEMBL_1671313 (CHEMBL4021342)
Ki
3.5±n/a nM
Citation
 Basu, SBarawkar, DARamdas, VPatel, MWaman, YPanmand, AKumar, SThorat, SNaykodi, MGoswami, AReddy, BSPrasad, VChaturvedi, SQuraishi, AMenon, SPaliwal, SKulkarni, AKarande, VGhosh, IMustafa, SDe, SJain, VBanerjee, ERRouduri, SRPalle, VPChugh, AMookhtiar, KA Design and synthesis of novel xanthine derivatives as potent and selective A Eur J Med Chem 134:218-229 (2017)  
Target
Name:
Adenosine receptor A2b
Synonyms:
AA2BR_HUMAN ADORA2B Adenosine receptors A2b | Adenosine receptors; A2a & A2b
Type:
G Protein-Coupled Receptor (GPCR)
Mol. Mass.:
36341.22
Organism:
Homo sapiens (Human)
Description:
Residue:
332
  
Inhibitor
Name:
BDBM50242134
Synonyms:
CHEMBL4075650
Type:
Small organic molecule
Emp. Form.:
C26H28N6O4
Mol. Mass.:
488.5383
SMILES:
CCCn1c2nc([nH]c2c(=O)n(CCC)c1=O)-c1cnn(CC#Cc2ccc(cc2)C(=O)OCC)c1
: