Target
Thromboxane A2 receptor
Ligand
BDBM50002819
Substrate
Meas. Tech.
ChEBML_209762
Ki
280±n/a nM
Citation
 Ohshima, ETakami, HSato, HMohri, SObase, HMiki, IIshii, AShirakura, SKarasawa, AKubo, K Non-prostanoid thromboxane A2 receptor antagonists with a dibenzoxepin ring system. 2. J Med Chem 35:3402-13 (1992)  
Target
Name:
Thromboxane A2 receptor
Synonyms:
Prostanoid TP receptor TBXA2R Thromboxane Thromboxane Beta
Type:
Enyzme
Mol. Mass.:
37445.28
Organism:
Homo sapiens (Human)
Description:
P21731
Residue:
343
  
Inhibitor
Name:
BDBM50002819
Synonyms:
11-(2-Naphtho[2,3-d]imidazol-1-yl-ethylidene)-6,11-dihydro-dibenzo[b,e]oxepine-2-carboxylic acid (0.25H2O) | CHEMBL324331
Type:
Small organic molecule
Emp. Form.:
C28H20N2O3
Mol. Mass.:
432.47
SMILES:
OC(=O)c1ccc2OCc3ccccc3\C(=C/Cn3cnc4cc5ccccc5cc34)c2c1
: