Target
Dipeptidyl peptidase 4
Ligand
BDBM11162
Substrate
Meas. Tech.
ChEMBL_1671400 (CHEMBL4021429)
IC50
46±n/a nM
Citation
 Sattigeri, JASethi, SDavis, JAAhmed, SRayasam, GVJadhav, BGChilla, SMDatta, DGadhave, ATulasi, VKJain, TVoleti, SBenjamin, BUdupa, SJain, GSingh, YSrinivas, KBansal, VSRay, ABhatnagar, PKCliffe, IA Approaches towards the development of chimeric DPP4/ACE inhibitors for treating metabolic syndrome. Bioorg Med Chem Lett 27:2313-2318 (2017)  
Target
Name:
Dipeptidyl peptidase 4
Synonyms:
Cd26 Dipeptidyl peptidase IV | Dpp4
Type:
PROTEIN
Mol. Mass.:
87433.73
Organism:
Mus musculus
Description:
ChEMBL_1335112
Residue:
760
  
Inhibitor
Name:
BDBM11162
Synonyms:
(1R)-3-oxo-3-[3-(trifluoroethyl)-5,6-dihydro[1,2,4]triazolo[4,3-a]pyrazin-7(8H)-yl]-1-(2,4,5-trifluorobenzyl)propylamine CHEMBL393336 Sitagliptin Triazolopiperazine Analogue 1 | US10479798, Compound MK0431
Type:
Small organic molecule
Emp. Form.:
C16H15F6N5O
Mol. Mass.:
407.3136
SMILES:
N[C@@H](CC(=O)N1CCn2c(C1)nnc2C(F)(F)F)Cc1cc(F)c(F)cc1F
: