Target
Androgen receptor
Ligand
BDBM50242309
Substrate
Meas. Tech.
ChEMBL_1671470 (CHEMBL4021499)
IC50
3.4±n/a nM
Citation
 Aikawa, KAsano, MOno, KHabuka, NYano, JWilson, KFujita, HKandori, HHara, TMorimoto, MSantou, TYamaoka, MNakayama, MHasuoka, A Synthesis and biological evaluation of novel selective androgen receptor modulators (SARMs) Part III: Discovery of 4-(5-oxopyrrolidine-1-yl)benzonitrile derivative 2f as a clinical candidate. Bioorg Med Chem 25:3330-3349 (2017)  
Target
Name:
Androgen receptor
Synonyms:
ANDR_HUMAN Androgen Receptor Androgen receptor/Baculoviral IAP repeat-containing protein 2 Dihydrotestosterone receptor Nuclear receptor subfamily 3 group C member 4
Type:
Receptor
Mol. Mass.:
99185.27
Organism:
Homo sapiens (Human)
Description:
CHO cells were stably transfected with human AR gene.
Residue:
920
  
Inhibitor
Name:
BDBM50242309
Synonyms:
CHEMBL4067691
Type:
Small organic molecule
Emp. Form.:
C13H13ClN2O2
Mol. Mass.:
264.708
SMILES:
CC[C@H]1[C@H](O)CC(=O)N1c1ccc(C#N)c(Cl)c1
: