Target
Cathepsin D
Ligand
BDBM50002985
Substrate
Meas. Tech.
ChEBML_44973
IC50
>10000±n/a nM
Citation
 Raddatz, PJonczyk, AMinck, KORippmann, FSchittenhelm, CSchmitges, CJ Renin inhibitors containing new P1-P1' dipeptide mimetics with heterocycles in P1'. J Med Chem 35:3525-36 (1992)  
Target
Name:
Cathepsin D
Synonyms:
CATD_BOVIN | CTSD
Type:
PROTEIN
Mol. Mass.:
42158.92
Organism:
Bos taurus
Description:
ChEMBL_1458606
Residue:
387
  
Inhibitor
Name:
BDBM50002985
Synonyms:
4-Amino-piperidine-1-carboxylic acid 1-{1-[1-cyclohexylmethyl-2-hydroxy-4-(thiazol-2-ylsulfanyl)-butylcarbamoyl]-2-methylsulfanyl-ethylcarbamoyl}-2-phenyl-ethyl ester | CHEMBL445901
Type:
Small organic molecule
Emp. Form.:
C33H49N5O5S3
Mol. Mass.:
691.968
SMILES:
CSC[C@H](NC(=O)[C@H](Cc1ccccc1)OC(=O)N1CCC(N)CC1)C(=O)N[C@@H](CC1CCCCC1)[C@@H](O)CCSc1nccs1
: