Target
Coagulation factor VII
Ligand
BDBM50242362
Substrate
Meas. Tech.
ChEMBL_1671569 (CHEMBL4021598)
Ki
360±n/a nM
Citation
 Wurtz, NRParkhurst, BLDeLucca, IGlunz, PWJiang, WZhang, XCheney, DLBozarth, JMRendina, ARWei, AHarper, TLuettgen, JMWu, YWong, PCSeiffert, DAWexler, RRPriestley, ES Neutral macrocyclic factor VIIa inhibitors. Bioorg Med Chem Lett 27:2650-2654 (2017)  
Target
Name:
Coagulation factor VII
Synonyms:
Eptacog alfa FA7_HUMAN Factor VIIa (fVIIa) SPCA serum prothrombin conversion accelerator
Type:
Enzyme
Mol. Mass.:
51599.89
Organism:
Homo sapiens (Human)
Description:
Residue:
466
  
Inhibitor
Name:
BDBM50242362
Synonyms:
CHEMBL4066874
Type:
Small organic molecule
Emp. Form.:
C33H34N4O6
Mol. Mass.:
582.6463
SMILES:
CCOC(=O)C[C@H]1NC(=O)[C@H](Nc2ccc3cc[nH]c(=O)c3c2)c2cc(C)c(CCOC(=O)Nc3cccc1c3)c(C)c2
: