Target
Protein mono-ADP-ribosyltransferase PARP14
Ligand
BDBM50242653
Substrate
Meas. Tech.
ChEMBL_1672032 (CHEMBL4022061)
IC50
275±n/a nM
Citation
 Upton, KMeyers, MThorsell, AGKarlberg, THolechek, JLease, RSchey, GWolf, ELucente, ASchüler, HFerraris, D Design and synthesis of potent inhibitors of the mono(ADP-ribosyl)transferase, PARP14. Bioorg Med Chem Lett 27:2907-2911 (2017)  
Target
Name:
Protein mono-ADP-ribosyltransferase PARP14
Synonyms:
(ARTD8 or PARP14) 2.4.2.- ADP-ribosyltransferase diphtheria toxin-like 8 B aggressive lymphoma protein 2 BAL2  KIAA1268 PAR14_HUMAN PARP14 Synonyms=BAL2
Type:
Mol. Mass.:
202812.41
Organism:
Homo sapiens (Human)
Description:
Q460N5
Residue:
1801
  
Inhibitor
Name:
BDBM50242653
Synonyms:
CHEMBL4074448
Type:
Small organic molecule
Emp. Form.:
C22H22FN3O3
Mol. Mass.:
395.4268
SMILES:
NC(=O)c1cccc(NC(=O)\C=C/C(=O)N2CCC(CC2)c2ccc(F)cc2)c1
: