Target
Protein mono-ADP-ribosyltransferase PARP14
Ligand
BDBM50242657
Substrate
Meas. Tech.
ChEMBL_1672032 (CHEMBL4022061)
IC50
372±n/a nM
Citation
 Upton, KMeyers, MThorsell, AGKarlberg, THolechek, JLease, RSchey, GWolf, ELucente, ASchüler, HFerraris, D Design and synthesis of potent inhibitors of the mono(ADP-ribosyl)transferase, PARP14. Bioorg Med Chem Lett 27:2907-2911 (2017)  
Target
Name:
Protein mono-ADP-ribosyltransferase PARP14
Synonyms:
(ARTD8 or PARP14) 2.4.2.- ADP-ribosyltransferase diphtheria toxin-like 8 B aggressive lymphoma protein 2 BAL2  KIAA1268 PAR14_HUMAN PARP14 Synonyms=BAL2
Type:
Mol. Mass.:
202812.41
Organism:
Homo sapiens (Human)
Description:
Q460N5
Residue:
1801
  
Inhibitor
Name:
BDBM50242657
Synonyms:
CHEMBL4104938
Type:
Small organic molecule
Emp. Form.:
C20H26N4O5
Mol. Mass.:
402.4442
SMILES:
CC(C)(C)OC(=O)N1CCN(CC1)C(=O)\C=C/C(=O)Nc1cccc(c1)C(N)=O
: