Target
Cholecystokinin receptor type A
Ligand
BDBM50003204
Substrate
Meas. Tech.
ChEBML_50207
IC50
25±n/a nM
Citation
 Tilley, JWDanho, WShiuey, SJKulesha, ISwistok, JMakofske, RMichalewsky, JTriscari, JNelson, DWeatherford, S Analogs of Ac-CCK-7 incorporating dipeptide mimics in place of Met28-Gly29. J Med Chem 35:3774-83 (1992)  
Target
Name:
Cholecystokinin receptor type A
Synonyms:
CCKAR_RAT Cholecystokinin peripheral Cholecystokinin receptor type A
Type:
Enzyme Catalytic Domain
Mol. Mass.:
49676.37
Organism:
RAT
Description:
Cholecystokinin central 0 RAT::P30551
Residue:
444
  
Inhibitor
Name:
BDBM50003204
Synonyms:
CHEMBL122438 | N-(1-Carbamoyl-2-phenyl-ethyl)-3-{2-[2-(2-{2-[2-carboxyamino-3-(4-sulfo-phenyl)-propionylamino]-cyclopentyl}-acetylamino)-3-(1H-indol-3-yl)-propionylamino]-4-methylsulfanyl-butyrylamino}-succinamic acid
Type:
Small organic molecule
Emp. Form.:
C46H56N8O13S2
Mol. Mass.:
993.113
SMILES:
CSCC[C@H](NC(=O)[C@H](Cc1c[nH]c2ccccc12)NC(=O)CC1CCC[C@H]1NC(=O)[C@H](Cc1ccc(cc1)S(O)(=O)=O)NC(O)=O)C(=O)N[C@@H](CC(O)=O)C(=O)N[C@@H](Cc1ccccc1)C(N)=O
: